-
CST software radiation pattern issues in my design
-
PDF - How to check a checkbox with FPDF?
-
What happens after a method is called in Java
-
How do I create file hardlink in PowerShell on Windows 10?
-
How to call destructor after response in php?
-
SAM build failed. Error: PythonPipBuilder:Validation - Binary validation failed for python. Did not satisfy constraints for runtime: python3.12
-
Cannot build frontend using Vite, TailwindCSS with PostCSS
-
`@import "tailwindcss";` does not work when used in a file with an `.scss` extension
-
Change the icon of the exe file generated from Visual Studio 2010
-
flutter using `get_mac_address` to get device MAC address: FormatException: Missing extension byte (at offset 1) error
-
Avoid non standard transitive includes in gcc / libstdc++
-
C++ Mouse Input HandleProblem
-
Why isn't font-face CSS working properly, did I mess up the file path?
-
ERROR Unknown error when running consumer: org.apache.kafka.common.errors.SerializationException: Unknown magic byte
-
Reverse array function with one parameter. (JavaScript)
-
How to check user Permissions using Custom Middleware in Laravel
-
Variables in where clause in Oracle PL/SQL Developer
-
NestJS typeorm - can't create entity
-
Exporting Godot 4.2.2 project to Xcode, when building project in Xcode it gives error: Undefined symbol: _main
-
Excel find Median from non contiguous cells and ignore 0 values
-
WSO2 API Manager BindException: Address already in use Despite Port Change and Free netstat
-
capture JieLi wifi Camera video stream
-
NiceGUI and Image Flicking during brighness adjustment
-
How to handle incompatible versions of PHP interfaces?
-
Eliminate render-blocking resources Wordpress